{"text_format":"1","workbook":"xlsx","n_sheets":7,"sheets":["Flowchart","Samenvatting","Colofoon - Disclaimer","Datatabellen","Variabelen","Totaal","Achtergrond"],"not_rendered":{"charts":1,"images":3,"macros":1,"external_links":1,"defined_names":157,"comments":5,"pivot_tables":0},"unopened":[],"bounds":{"document_bytes":16777216,"sheet_cells":100000,"rows_first":2000,"rows_last":500,"rows_between":2000,"halvings":0,"cell_chars":16384,"cell_head_chars":4096},"cells_cut":0,"cells_raw":0,"read":"whole","date_system":"1900"}

{"sheet":"Flowchart","index":0,"n_rows":78,"n_cols":18,"rows_kept":78,"cut":false,"hidden":false,"merged":[]}
["Indicatie financieel rendement per businesscase; voor verschillende projectperiodes"]
["Case","10 jaar","15 jaar","20 jaar","Complexiteit","Snelheid uitvoer","Bruikbaar","ID#"]
["PCR Algemeen",{"$f":"Totaal!A147","v":-2.9977102267419564E-2},{"$f":"Totaal!A148","v":5.3635849229179522E-2},{"$f":"Totaal!A149","v":3.3957549130331666E-2},{"$f":"IF($G$44>=1,1,0)","v":1},1,1,"M"]
["SDE Algemeen - Fase 4",{"$f":"Totaal!A88","v":-1.2565585751259101E-2},{"$f":"Totaal!A89","v":6.5740320566624044E-2},{"$f":"Totaal!A90","v":5.6128969674710039E-2},{"$f":"IF($G$44>=0,1,0)","v":1},{"$f":"IF(DAYS360(TODAY(),DATE(2016,9,19))+90<$G$45*365,1,0)","v":1},{"$f":"IF($G$33<15000,0,1)","v":1},"D"]
["SDE Algemeen - Fase 3",{"$f":"Totaal!A82","v":-1.2565585751259101E-2},{"$f":"Totaal!A83","v":6.5740320566624044E-2},{"$f":"Totaal!A84","v":5.6128969674710039E-2},{"$f":"IF($G$44>=0,1,0)","v":1},{"$f":"IF(DAYS360(TODAY(),DATE(2016,9,12))+90<$G$45*365,1,0)","v":1},{"$f":"IF($G$33<15000,0,1)","v":1},"C"]
["SDE met verkoop systeem - Fase 4",{"$f":"Totaal!A138","v":5.5564252250481561E-2},{"$f":"Totaal!A139","v":5.5564252250481561E-2},{"$f":"Totaal!A140","v":5.5564252250481561E-2},{"$f":"IF($G$44>=1,1,0)","v":1},{"$f":"IF(DAYS360(TODAY(),DATE(2016,9,19))+90<$G$45*365,1,0)","v":1},{"$f":"IF($G$33<15000,0,1)","v":1},"L"]
["SDE met verkoop systeem - Fase 3",{"$f":"Totaal!A132","v":5.5564252250481561E-2},{"$f":"Totaal!A133","v":5.5564252250481561E-2},{"$f":"Totaal!A134","v":5.5564252250481561E-2},{"$f":"IF($G$44>=1,1,0)","v":1},{"$f":"IF(DAYS360(TODAY(),DATE(2016,9,12))+90<$G$45*365,1,0)","v":1},{"$f":"IF($G$33<15000,0,1)","v":1},"K"]
["PCR met verkoop systeem",{"$f":"Totaal!A165","v":3.3489567321222102E-2},{"$f":"Totaal!A166","v":3.3489567321222102E-2},{"$f":"Totaal!A167","v":3.3489567321222102E-2},{"$f":"IF($G$44>=1,1,0)","v":1},1,1,"O"]
["SDE Algemeen - Fase 2",{"$f":"Totaal!A76","v":-4.9304586721560795E-2},{"$f":"Totaal!A77","v":4.2398160707474375E-2},{"$f":"Totaal!A78","v":3.0372019776658821E-2},{"$f":"IF($G$44>=0,1,0)","v":1},{"$f":"IF(DAYS360(TODAY(),DATE(2016,9,5))+90<$G$45*365,1,0)","v":1},{"$f":"IF($G$33<15000,0,1)","v":1},"B"]
["SDE met verkoop systeem - Fase 2",{"$f":"Totaal!A126","v":3.2887518523707193E-2},{"$f":"Totaal!A127","v":3.2887518523707193E-2},{"$f":"Totaal!A128","v":3.2887518523707193E-2},{"$f":"IF($G$44>=1,1,0)","v":1},{"$f":"IF(DAYS360(TODAY(),DATE(2016,9,5))+90<$G$45*365,1,0)","v":1},{"$f":"IF($G$33<15000,0,1)","v":1},"J"]
{"$rows_left_out":69}
{"sheet":"Samenvatting","index":1,"n_rows":45,"n_cols":28,"rows_kept":45,"cut":false,"hidden":false,"merged":[[1,3,1,6]]}
[null,null,null,null,null,null,null,null,"ID"]
["Selecteer Businescase",null,null,"Salderen",null,null,null,null,{"$f":"IF(D2>0,VLOOKUP(D2,Tabel_BuCas[],8,FALSE),Flowchart!H3)","v":"P"}]
[]
["Categorie","Sub"]
["Jaar",null,0,1,2,3,4,5,6,7,8,9,10,11,12,13,14,15,16,17,18,19,20,21,22,23,24,25]
["Productie",null,{"$f":"ROUND(Totaal!C3,0)","v":0},{"$f":"ROUND(Totaal!D3,0)","v":152408},{"$f":"ROUND(Totaal!E3,0)","v":151341},{"$f":"ROUND(Totaal!F3,0)","v":150282},{"$f":"ROUND(Totaal!G3,0)","v":149230},{"$f":"ROUND(Totaal!H3,0)","v":148186},{"$f":"ROUND(Totaal!I3,0)","v":147148},{"$f":"ROUND(Totaal!J3,0)","v":146118},{"$f":"ROUND(Totaal!K3,0)","v":145095},{"$f":"ROUND(Totaal!L3,0)","v":144080},{"$f":"ROUND(Totaal!M3,0)","v":143071},{"$f":"ROUND(Totaal!N3,0)","v":142070},{"$f":"ROUND(Totaal!O3,0)","v":141075},{"$f":"ROUND(Totaal!P3,0)","v":140088},{"$f":"ROUND(Totaal!Q3,0)","v":139107},{"$f":"ROUND(Totaal!R3,0)","v":138133},{"$f":"ROUND(Totaal!S3,0)","v":137166},{"$f":"ROUND(Totaal!T3,0)","v":136206},{"$f":"ROUND(Totaal!U3,0)","v":135253},{"$f":"ROUND(Totaal!V3,0)","v":134306},{"$f":"ROUND(Totaal!W3,0)","v":133366},{"$f":"ROUND(Totaal!X3,0)","v":132432},{"$f":"ROUND(Totaal!Y3,0)","v":131505},{"$f":"ROUND(Totaal!Z3,0)","v":130585},{"$f":"ROUND(Totaal!AA3,0)","v":129671},{"$f":"ROUND(Totaal!AB3,0)","v":128763}]
[]
["Investering",null,{"$f":"ROUND(Totaal!C5,0)","v":191367},{"$f":"ROUND(Totaal!D5,0)","v":0},{"$f":"ROUND(Totaal!E5,0)","v":0},{"$f":"ROUND(Totaal!F5,0)","v":0},{"$f":"ROUND(Totaal!G5,0)","v":0},{"$f":"ROUND(Totaal!H5,0)","v":0},{"$f":"ROUND(Totaal!I5,0)","v":0},{"$f":"ROUND(Totaal!J5,0)","v":0},{"$f":"ROUND(Totaal!K5,0)","v":0},{"$f":"ROUND(Totaal!L5,0)","v":0},{"$f":"ROUND(Totaal!M5,0)","v":0},{"$f":"ROUND(Totaal!N5,0)","v":0},{"$f":"ROUND(Totaal!O5,0)","v":0},{"$f":"ROUND(Totaal!P5,0)","v":0},{"$f":"ROUND(Totaal!Q5,0)","v":0},{"$f":"ROUND(Totaal!R5,0)","v":0},{"$f":"ROUND(Totaal!S5,0)","v":40806},{"$f":"ROUND(Totaal!T5,0)","v":0},{"$f":"ROUND(Totaal!U5,0)","v":0},{"$f":"ROUND(Totaal!V5,0)","v":0},{"$f":"ROUND(Totaal!W5,0)","v":0},{"$f":"ROUND(Totaal!X5,0)","v":0},{"$f":"ROUND(Totaal!Y5,0)","v":0},{"$f":"ROUND(Totaal!Z5,0)","v":0},{"$f":"ROUND(Totaal!AA5,0)","v":0},{"$f":"ROUND(Totaal!AB5,0)","v":0}]
[null,"Systeemkosten",{"$f":"ROUND(Totaal!C6,0)","v":163560},{"$f":"ROUND(Totaal!D6,0)","v":0},{"$f":"ROUND(Totaal!E6,0)","v":0},{"$f":"ROUND(Totaal!F6,0)","v":0},{"$f":"ROUND(Totaal!G6,0)","v":0},{"$f":"ROUND(Totaal!H6,0)","v":0},{"$f":"ROUND(Totaal!I6,0)","v":0},{"$f":"ROUND(Totaal!J6,0)","v":0},{"$f":"ROUND(Totaal!K6,0)","v":0},{"$f":"ROUND(Totaal!L6,0)","v":0},{"$f":"ROUND(Totaal!M6,0)","v":0},{"$f":"ROUND(Totaal!N6,0)","v":0},{"$f":"ROUND(Totaal!O6,0)","v":0},{"$f":"ROUND(Totaal!P6,0)","v":0},{"$f":"ROUND(Totaal!Q6,0)","v":0},{"$f":"ROUND(Totaal!R6,0)","v":0},{"$f":"ROUND(Totaal!S6,0)","v":40806},{"$f":"ROUND(Totaal!T6,0)","v":0},{"$f":"ROUND(Totaal!U6,0)","v":0},{"$f":"ROUND(Totaal!V6,0)","v":0},{"$f":"ROUND(Totaal!W6,0)","v":0},{"$f":"ROUND(Totaal!X6,0)","v":0},{"$f":"ROUND(Totaal!Y6,0)","v":0},{"$f":"ROUND(Totaal!Z6,0)","v":0},{"$f":"ROUND(Totaal!AA6,0)","v":0},{"$f":"ROUND(Totaal!AB6,0)","v":0}]
[null,"Projectkosten",{"$f":"ROUND(Totaal!C7,0)","v":27807},{"$f":"ROUND(Totaal!D7,0)","v":0},{"$f":"ROUND(Totaal!E7,0)","v":0},{"$f":"ROUND(Totaal!F7,0)","v":0},{"$f":"ROUND(Totaal!G7,0)","v":0},{"$f":"ROUND(Totaal!H7,0)","v":0},{"$f":"ROUND(Totaal!I7,0)","v":0},{"$f":"ROUND(Totaal!J7,0)","v":0},{"$f":"ROUND(Totaal!K7,0)","v":0},{"$f":"ROUND(Totaal!L7,0)","v":0},{"$f":"ROUND(Totaal!M7,0)","v":0},{"$f":"ROUND(Totaal!N7,0)","v":0},{"$f":"ROUND(Totaal!O7,0)","v":0},{"$f":"ROUND(Totaal!P7,0)","v":0},{"$f":"ROUND(Totaal!Q7,0)","v":0},{"$f":"ROUND(Totaal!R7,0)","v":0},{"$f":"ROUND(Totaal!S7,0)","v":0},{"$f":"ROUND(Totaal!T7,0)","v":0},{"$f":"ROUND(Totaal!U7,0)","v":0},{"$f":"ROUND(Totaal!V7,0)","v":0},{"$f":"ROUND(Totaal!W7,0)","v":0},{"$f":"ROUND(Totaal!X7,0)","v":0},{"$f":"ROUND(Totaal!Y7,0)","v":0},{"$f":"ROUND(Totaal!Z7,0)","v":0},{"$f":"ROUND(Totaal!AA7,0)","v":0},{"$f":"ROUND(Totaal!AB7,0)","v":0}]
{"$rows_left_out":36}
{"sheet":"Colofoon - Disclaimer","index":2,"n_rows":25,"n_cols":3,"rows_kept":25,"cut":false,"hidden":false,"merged":[[15,2,22,10]]}
[]
[null,"Flowchartmodel Zonneparken"]
[]
[null,"Op basis van modellen door:"]
[null,null,"Hans Rikze - Morgen Groene Energie"]
[null,null,"Floris Bruning - Soft Energy"]
[]
[null,"Rekenmodel:"]
[null,null,"Floris Bruning - Soft Energy"]
[]
{"$rows_left_out":16}
{"sheet":"Datatabellen","index":3,"n_rows":58,"n_cols":11,"rows_kept":58,"cut":false,"hidden":true,"merged":[]}
["data tabel netaansluitingen (Stedin 2015)",null,null,null,null,null,null,null,null,"*schatting GV"]
["Max Cap.","Max vermogen","Euro/Aansluiting","Euro/Meter","Jaarkosten",null,"periodiek","vast trans","capaciteit","meterhuur"]
["10000 kVA",10000000,258814.87,140.30000000000001,7000.0036,null,7484,2760,null,800]
["3000 kVA",3000000,189449.99,123.44,1352.271,null,1448,2760,null,800]
["1750 kVA",1750000,43891.839999999997,92,1352.271,null,634,441,null,800]
["1000 kVA",1000000,36432.699999999997,86.63,619.29100000000005,null,634,441,null,800]
["630 kVA",630000,34391.08,76.44,619.29100000000005,null,634,441,null,400]
["175 kVA",175000,3844.76,46.79,67.637900000000002,null,69,441,null,400]
["3 x 125 A",{"$f":"125*3*230","v":86250},3059.93,45.14,67.637900000000002,null,69,441,null,400]
["3 x 80 A",{"$f":"3*80*230","v":55200},1166.08,34.4,28.510400000000001,null,30,18,1650,28]
{"$rows_left_out":49}
{"sheet":"Variabelen","index":4,"n_rows":26,"n_cols":12,"rows_kept":26,"cut":false,"hidden":true,"merged":[]}
["Installatie",null,null,"Inkomsten",null,null,"Uitgaven",null,null,"Ledendelen"]
["Wp per paneel",270,"Wp","Tarieven",null,null,"netwerkkosten",{"$f":"IF(AND(Flowchart!G38=\"ja\",Flowchart!G39=\"ja\"),0,INDEX(Datatabellen!E3:E13,MATCH(Variabelen!B3,Datatabellen!B3:B13,-1)))","v":67.637900000000002},"euro","Zonnedeel euro",null,"euro"]
["Vermogen",{"$f":"IF(Flowchart!G33>0,Flowchart!G33,ROUND((Flowchart!G31*Flowchart!G32)*0.8/VLOOKUP(B8,Tabel_Oppervlak,2,FALSE),0)*B2)","v":174000},"Wp","kWh  prijs markt",3.5000000000000003E-2,"euro/kWh","onderhoud",5.0000000000000001E-3,"euro/Wp","Zonnedeel Wp",250,"?"]
["Productiefactor",{"$f":"VLOOKUP(Flowchart!G27,Tabel_Provincie,2,FALSE)*(VLOOKUP(Flowchart!G30,Tabel_Orientatie,ROUND(IF(Flowchart!G28=\"Schuin\",Flowchart!G29,VLOOKUP(Flowchart!G28,Tabel_Oppervlak,3,FALSE))/10,0)+2,FALSE))","v":0.87590999999999997},"kWh/Wp","kWh prijs levering",0.05,"euro/kWh","vervanging",5.0000000000000001E-3,"euro/Wp","Aantal zonnedelen",{"$f":"ROUNDUP(IF(K2>0,B24*B3/(K2),B3/K3),0)","v":696}]
["degradatie panelen",0.7,"%/y","GVO bedrag",5.0000000000000001E-3,"euro/kWh","huur locatie",3.0000000000000001E-3,"euro/Wp","euro per zonnedeel",{"$f":"ROUNDUP(IF(K2>0,K2,B3*B24*Aandeel_leden/K4),0)","v":165}]
["Zelfconsumptie",0.5,"%",null,null,null,"verzekering",2.5000000000000001E-3,"euro/Wp"]
["CO2 reductie",0.35499999999999998,"kg/kWh","Energiebelasting",null,null,"Administratie",3.0000000000000001E-3,"euro/Wp","Overige factoren"]
["Locatie",{"$f":"Flowchart!G28","v":"Plat"},null,"Energiebelasting 1",0.1087,"euro/kWh","Vervangen omvormer",16,"jaar","BTW",0.21]
["Verbruik locatie",{"$f":"Flowchart!G36","v":0},"kWh/yr","Energiebelasting 2",6.13E-2,"euro/kWh",null,null,null,"VPB",0.2]
["Netaansluiting nodig",{"$f":"INDEX(Datatabellen!A3:A13,MATCH(Variabelen!B3,Datatabellen!B3:B13,-1))","v":"175 kVA"},null,"Energiebelasting 3",1.6400000000000001E-2,"euro/kWh","Financieel",null,null,"Stijging energiebelasting",0]
{"$rows_left_out":17}
{"sheet":"Totaal","index":5,"n_rows":192,"n_cols":86,"rows_kept":192,"cut":false,"hidden":true,"merged":[]}
["Categorie","Sub"]
["Jaar",null,0,1,2,3,4,5,6,7,8,9,10,11,12,13,14,15,16,17,18,19,20,21,22,23,24,25]
["Productie",null,0,{"$f":"Variabelen!$B$3*Variabelen!$B$4*((1-(Variabelen!$B$5/100))^C2)","v":152408.34},{"$f":"Variabelen!$B$3*Variabelen!$B$4*((1-(Variabelen!$B$5/100))^D2)","v":151341.48162000001},{"$f":"Variabelen!$B$3*Variabelen!$B$4*((1-(Variabelen!$B$5/100))^E2)","v":150282.09124866},{"$f":"Variabelen!$B$3*Variabelen!$B$4*((1-(Variabelen!$B$5/100))^F2)","v":149230.11660991935},{"$f":"Variabelen!$B$3*Variabelen!$B$4*((1-(Variabelen!$B$5/100))^G2)","v":148185.50579364994},{"$f":"Variabelen!$B$3*Variabelen!$B$4*((1-(Variabelen!$B$5/100))^H2)","v":147148.20725309438},{"$f":"Variabelen!$B$3*Variabelen!$B$4*((1-(Variabelen!$B$5/100))^I2)","v":146118.16980232272},{"$f":"Variabelen!$B$3*Variabelen!$B$4*((1-(Variabelen!$B$5/100))^J2)","v":145095.34261370645},{"$f":"Variabelen!$B$3*Variabelen!$B$4*((1-(Variabelen!$B$5/100))^K2)","v":144079.67521541051},{"$f":"Variabelen!$B$3*Variabelen!$B$4*((1-(Variabelen!$B$5/100))^L2)","v":143071.11748890262},{"$f":"Variabelen!$B$3*Variabelen!$B$4*((1-(Variabelen!$B$5/100))^M2)","v":142069.61966648031},{"$f":"Variabelen!$B$3*Variabelen!$B$4*((1-(Variabelen!$B$5/100))^N2)","v":141075.13232881494},{"$f":"Variabelen!$B$3*Variabelen!$B$4*((1-(Variabelen!$B$5/100))^O2)","v":140087.60640251322},{"$f":"Variabelen!$B$3*Variabelen!$B$4*((1-(Variabelen!$B$5/100))^P2)","v":139106.99315769563},{"$f":"Variabelen!$B$3*Variabelen!$B$4*((1-(Variabelen!$B$5/100))^Q2)","v":138133.24420559176},{"$f":"Variabelen!$B$3*Variabelen!$B$4*((1-(Variabelen!$B$5/100))^R2)","v":137166.3114961526},{"$f":"Variabelen!$B$3*Variabelen!$B$4*((1-(Variabelen!$B$5/100))^S2)","v":136206.14731567953},{"$f":"Variabelen!$B$3*Variabelen!$B$4*((1-(Variabelen!$B$5/100))^T2)","v":135252.70428446977},{"$f":"Variabelen!$B$3*Variabelen!$B$4*((1-(Variabelen!$B$5/100))^U2)","v":134305.93535447848},{"$f":"Variabelen!$B$3*Variabelen!$B$4*((1-(Variabelen!$B$5/100))^V2)","v":133365.79380699713},{"$f":"Variabelen!$B$3*Variabelen!$B$4*((1-(Variabelen!$B$5/100))^W2)","v":132432.23325034816},{"$f":"Variabelen!$B$3*Variabelen!$B$4*((1-(Variabelen!$B$5/100))^X2)","v":131505.2076175957},{"$f":"Variabelen!$B$3*Variabelen!$B$4*((1-(Variabelen!$B$5/100))^Y2)","v":130584.67116427253},{"$f":"Variabelen!$B$3*Variabelen!$B$4*((1-(Variabelen!$B$5/100))^Z2)","v":129670.57846612262},{"$f":"Variabelen!$B$3*Variabelen!$B$4*((1-(Variabelen!$B$5/100))^AA2)","v":128762.88441685976}]
[]
["Investering",null,{"$f":"IF(C2=0,Variabelen!$B$24*Variabelen!$B$3,0)+IF(C2=Variabelen!$H$8,Variabelen!$B$13*Variabelen!$B$3*(1+Variabelen!$K$13)^C2)","v":191367.23550000001},{"$f":"IF(D2=0,Variabelen!$B$24*Variabelen!$B$3,0)+IF(D2=Variabelen!$H$8,Variabelen!$B$13*Variabelen!$B$3*(1+Variabelen!$K$13)^D2)","v":0},{"$f":"IF(E2=0,Variabelen!$B$24*Variabelen!$B$3,0)+IF(E2=Variabelen!$H$8,Variabelen!$B$13*Variabelen!$B$3*(1+Variabelen!$K$13)^E2)","v":0},{"$f":"IF(F2=0,Variabelen!$B$24*Variabelen!$B$3,0)+IF(F2=Variabelen!$H$8,Variabelen!$B$13*Variabelen!$B$3*(1+Variabelen!$K$13)^F2)","v":0},{"$f":"IF(G2=0,Variabelen!$B$24*Variabelen!$B$3,0)+IF(G2=Variabelen!$H$8,Variabelen!$B$13*Variabelen!$B$3*(1+Variabelen!$K$13)^G2)","v":0},{"$f":"IF(H2=0,Variabelen!$B$24*Variabelen!$B$3,0)+IF(H2=Variabelen!$H$8,Variabelen!$B$13*Variabelen!$B$3*(1+Variabelen!$K$13)^H2)","v":0},{"$f":"IF(I2=0,Variabelen!$B$24*Variabelen!$B$3,0)+IF(I2=Variabelen!$H$8,Variabelen!$B$13*Variabelen!$B$3*(1+Variabelen!$K$13)^I2)","v":0},{"$f":"IF(J2=0,Variabelen!$B$24*Variabelen!$B$3,0)+IF(J2=Variabelen!$H$8,Variabelen!$B$13*Variabelen!$B$3*(1+Variabelen!$K$13)^J2)","v":0},{"$f":"IF(K2=0,Variabelen!$B$24*Variabelen!$B$3,0)+IF(K2=Variabelen!$H$8,Variabelen!$B$13*Variabelen!$B$3*(1+Variabelen!$K$13)^K2)","v":0},{"$f":"IF(L2=0,Variabelen!$B$24*Variabelen!$B$3,0)+IF(L2=Variabelen!$H$8,Variabelen!$B$13*Variabelen!$B$3*(1+Variabelen!$K$13)^L2)","v":0},{"$f":"IF(M2=0,Variabelen!$B$24*Variabelen!$B$3,0)+IF(M2=Variabelen!$H$8,Variabelen!$B$13*Variabelen!$B$3*(1+Variabelen!$K$13)^M2)","v":0},{"$f":"IF(N2=0,Variabelen!$B$24*Variabelen!$B$3,0)+IF(N2=Variabelen!$H$8,Variabelen!$B$13*Variabelen!$B$3*(1+Variabelen!$K$13)^N2)","v":0},{"$f":"IF(O2=0,Variabelen!$B$24*Variabelen!$B$3,0)+IF(O2=Variabelen!$H$8,Variabelen!$B$13*Variabelen!$B$3*(1+Variabelen!$K$13)^O2)","v":0},{"$f":"IF(P2=0,Variabelen!$B$24*Variabelen!$B$3,0)+IF(P2=Variabelen!$H$8,Variabelen!$B$13*Variabelen!$B$3*(1+Variabelen!$K$13)^P2)","v":0},{"$f":"IF(Q2=0,Variabelen!$B$24*Variabelen!$B$3,0)+IF(Q2=Variabelen!$H$8,Variabelen!$B$13*Variabelen!$B$3*(1+Variabelen!$K$13)^Q2)","v":0},{"$f":"IF(R2=0,Variabelen!$B$24*Variabelen!$B$3,0)+IF(R2=Variabelen!$H$8,Variabelen!$B$13*Variabelen!$B$3*(1+Variabelen!$K$13)^R2)","v":0},{"$f":"IF(S2=0,Variabelen!$B$24*Variabelen!$B$3,0)+IF(S2=Variabelen!$H$8,Variabelen!$B$13*Variabelen!$B$3*(1+Variabelen!$K$13)^S2)","v":40805.736843344719},{"$f":"IF(T2=0,Variabelen!$B$24*Variabelen!$B$3,0)+IF(T2=Variabelen!$H$8,Variabelen!$B$13*Variabelen!$B$3*(1+Variabelen!$K$13)^T2)","v":0},{"$f":"IF(U2=0,Variabelen!$B$24*Variabelen!$B$3,0)+IF(U2=Variabelen!$H$8,Variabelen!$B$13*Variabelen!$B$3*(1+Variabelen!$K$13)^U2)","v":0},{"$f":"IF(V2=0,Variabelen!$B$24*Variabelen!$B$3,0)+IF(V2=Variabelen!$H$8,Variabelen!$B$13*Variabelen!$B$3*(1+Variabelen!$K$13)^V2)","v":0},{"$f":"IF(W2=0,Variabelen!$B$24*Variabelen!$B$3,0)+IF(W2=Variabelen!$H$8,Variabelen!$B$13*Variabelen!$B$3*(1+Variabelen!$K$13)^W2)","v":0},{"$f":"IF(X2=0,Variabelen!$B$24*Variabelen!$B$3,0)+IF(X2=Variabelen!$H$8,Variabelen!$B$13*Variabelen!$B$3*(1+Variabelen!$K$13)^X2)","v":0},{"$f":"IF(Y2=0,Variabelen!$B$24*Variabelen!$B$3,0)+IF(Y2=Variabelen!$H$8,Variabelen!$B$13*Variabelen!$B$3*(1+Variabelen!$K$13)^Y2)","v":0},{"$f":"IF(Z2=0,Variabelen!$B$24*Variabelen!$B$3,0)+IF(Z2=Variabelen!$H$8,Variabelen!$B$13*Variabelen!$B$3*(1+Variabelen!$K$13)^Z2)","v":0},{"$f":"IF(AA2=0,Variabelen!$B$24*Variabelen!$B$3,0)+IF(AA2=Variabelen!$H$8,Variabelen!$B$13*Variabelen!$B$3*(1+Variabelen!$K$13)^AA2)","v":0},{"$f":"IF(AB2=0,Variabelen!$B$24*Variabelen!$B$3,0)+IF(AB2=Variabelen!$H$8,Variabelen!$B$13*Variabelen!$B$3*(1+Variabelen!$K$13)^AB2)","v":0}]
[null,"Systeemkosten",{"$f":"IF(C2=0,SUM(Variabelen!$B$12:$B$15)*Variabelen!$B$3,0)+IF(C2=Variabelen!$H$8,Variabelen!$B$13*Variabelen!$B$3*(1+Variabelen!$K$13)^C2)","v":163560},{"$f":"IF(D2=0,SUM(Variabelen!$B$12:$B$15)*Variabelen!$B$3,0)+IF(D2=Variabelen!$H$8,Variabelen!$B$13*Variabelen!$B$3*(1+Variabelen!$K$13)^D2)","v":0},{"$f":"IF(E2=0,SUM(Variabelen!$B$12:$B$15)*Variabelen!$B$3,0)+IF(E2=Variabelen!$H$8,Variabelen!$B$13*Variabelen!$B$3*(1+Variabelen!$K$13)^E2)","v":0},{"$f":"IF(F2=0,SUM(Variabelen!$B$12:$B$15)*Variabelen!$B$3,0)+IF(F2=Variabelen!$H$8,Variabelen!$B$13*Variabelen!$B$3*(1+Variabelen!$K$13)^F2)","v":0},{"$f":"IF(G2=0,SUM(Variabelen!$B$12:$B$15)*Variabelen!$B$3,0)+IF(G2=Variabelen!$H$8,Variabelen!$B$13*Variabelen!$B$3*(1+Variabelen!$K$13)^G2)","v":0},{"$f":"IF(H2=0,SUM(Variabelen!$B$12:$B$15)*Variabelen!$B$3,0)+IF(H2=Variabelen!$H$8,Variabelen!$B$13*Variabelen!$B$3*(1+Variabelen!$K$13)^H2)","v":0},{"$f":"IF(I2=0,SUM(Variabelen!$B$12:$B$15)*Variabelen!$B$3,0)+IF(I2=Variabelen!$H$8,Variabelen!$B$13*Variabelen!$B$3*(1+Variabelen!$K$13)^I2)","v":0},{"$f":"IF(J2=0,SUM(Variabelen!$B$12:$B$15)*Variabelen!$B$3,0)+IF(J2=Variabelen!$H$8,Variabelen!$B$13*Variabelen!$B$3*(1+Variabelen!$K$13)^J2)","v":0},{"$f":"IF(K2=0,SUM(Variabelen!$B$12:$B$15)*Variabelen!$B$3,0)+IF(K2=Variabelen!$H$8,Variabelen!$B$13*Variabelen!$B$3*(1+Variabelen!$K$13)^K2)","v":0},{"$f":"IF(L2=0,SUM(Variabelen!$B$12:$B$15)*Variabelen!$B$3,0)+IF(L2=Variabelen!$H$8,Variabelen!$B$13*Variabelen!$B$3*(1+Variabelen!$K$13)^L2)","v":0},{"$f":"IF(M2=0,SUM(Variabelen!$B$12:$B$15)*Variabelen!$B$3,0)+IF(M2=Variabelen!$H$8,Variabelen!$B$13*Variabelen!$B$3*(1+Variabelen!$K$13)^M2)","v":0},{"$f":"IF(N2=0,SUM(Variabelen!$B$12:$B$15)*Variabelen!$B$3,0)+IF(N2=Variabelen!$H$8,Variabelen!$B$13*Variabelen!$B$3*(1+Variabelen!$K$13)^N2)","v":0},{"$f":"IF(O2=0,SUM(Variabelen!$B$12:$B$15)*Variabelen!$B$3,0)+IF(O2=Variabelen!$H$8,Variabelen!$B$13*Variabelen!$B$3*(1+Variabelen!$K$13)^O2)","v":0},{"$f":"IF(P2=0,SUM(Variabelen!$B$12:$B$15)*Variabelen!$B$3,0)+IF(P2=Variabelen!$H$8,Variabelen!$B$13*Variabelen!$B$3*(1+Variabelen!$K$13)^P2)","v":0},{"$f":"IF(Q2=0,SUM(Variabelen!$B$12:$B$15)*Variabelen!$B$3,0)+IF(Q2=Variabelen!$H$8,Variabelen!$B$13*Variabelen!$B$3*(1+Variabelen!$K$13)^Q2)","v":0},{"$f":"IF(R2=0,SUM(Variabelen!$B$12:$B$15)*Variabelen!$B$3,0)+IF(R2=Variabelen!$H$8,Variabelen!$B$13*Variabelen!$B$3*(1+Variabelen!$K$13)^R2)","v":0},{"$f":"IF(S2=0,SUM(Variabelen!$B$12:$B$15)*Variabelen!$B$3,0)+IF(S2=Variabelen!$H$8,Variabelen!$B$13*Variabelen!$B$3*(1+Variabelen!$K$13)^S2)","v":40805.736843344719},{"$f":"IF(T2=0,SUM(Variabelen!$B$12:$B$15)*Variabelen!$B$3,0)+IF(T2=Variabelen!$H$8,Variabelen!$B$13*Variabelen!$B$3*(1+Variabelen!$K$13)^T2)","v":0},{"$f":"IF(U2=0,SUM(Variabelen!$B$12:$B$15)*Variabelen!$B$3,0)+IF(U2=Variabelen!$H$8,Variabelen!$B$13*Variabelen!$B$3*(1+Variabelen!$K$13)^U2)","v":0},{"$f":"IF(V2=0,SUM(Variabelen!$B$12:$B$15)*Variabelen!$B$3,0)+IF(V2=Variabelen!$H$8,Variabelen!$B$13*Variabelen!$B$3*(1+Variabelen!$K$13)^V2)","v":0},{"$f":"IF(W2=0,SUM(Variabelen!$B$12:$B$15)*Variabelen!$B$3,0)+IF(W2=Variabelen!$H$8,Variabelen!$B$13*Variabelen!$B$3*(1+Variabelen!$K$13)^W2)","v":0},{"$f":"IF(X2=0,SUM(Variabelen!$B$12:$B$15)*Variabelen!$B$3,0)+IF(X2=Variabelen!$H$8,Variabelen!$B$13*Variabelen!$B$3*(1+Variabelen!$K$13)^X2)","v":0},{"$f":"IF(Y2=0,SUM(Variabelen!$B$12:$B$15)*Variabelen!$B$3,0)+IF(Y2=Variabelen!$H$8,Variabelen!$B$13*Variabelen!$B$3*(1+Variabelen!$K$13)^Y2)","v":0},{"$f":"IF(Z2=0,SUM(Variabelen!$B$12:$B$15)*Variabelen!$B$3,0)+IF(Z2=Variabelen!$H$8,Variabelen!$B$13*Variabelen!$B$3*(1+Variabelen!$K$13)^Z2)","v":0},{"$f":"IF(AA2=0,SUM(Variabelen!$B$12:$B$15)*Variabelen!$B$3,0)+IF(AA2=Variabelen!$H$8,Variabelen!$B$13*Variabelen!$B$3*(1+Variabelen!$K$13)^AA2)","v":0},{"$f":"IF(AB2=0,SUM(Variabelen!$B$12:$B$15)*Variabelen!$B$3,0)+IF(AB2=Variabelen!$H$8,Variabelen!$B$13*Variabelen!$B$3*(1+Variabelen!$K$13)^AB2)","v":0}]
[null,"Projectkosten",{"$f":"C5-C6","v":27807.23550000001},{"$f":"D5-D6","v":0},0,0,0,0,0,0,0,0,0,0,0,0,0,0,0,0,0,0,0,{"$f":"X5-X6","v":0},0,0,0,0]
[]
[null,null,null,null,null,null,null,null,null,null,null,null,null,null,null,null,null,null,null,null,null,null,null,null,null,null,null,null,null,null,null,null,null,null,null,null,null,null,null,null,null,null,null,null,null,null,null,null,null,null,null,null,null,null,null,null,null,null,null,null,null,null,null,null,null,null,null,null,null,"CasesPlace"]
["Restwaarde",null,{"$f":"SUM($C$6:C6)-SUM($C$11:C11)","v":163560},{"$f":"SUM($C$6:D6)-SUM($C$11:D11)","v":153746.4},{"$f":"SUM($C$6:E6)-SUM($C$11:E11)","v":143932.79999999999},{"$f":"SUM($C$6:F6)-SUM($C$11:F11)","v":134119.20000000001},{"$f":"SUM($C$6:G6)-SUM($C$11:G11)","v":124305.60000000001},{"$f":"SUM($C$6:H6)-SUM($C$11:H11)","v":114492},{"$f":"SUM($C$6:I6)-SUM($C$11:I11)","v":104678.39999999999},{"$f":"SUM($C$6:J6)-SUM($C$11:J11)","v":94864.8},{"$f":"SUM($C$6:K6)-SUM($C$11:K11)","v":85051.199999999997},{"$f":"SUM($C$6:L6)-SUM($C$11:L11)","v":75237.599999999991},{"$f":"SUM($C$6:M6)-SUM($C$11:M11)","v":65423.999999999985},{"$f":"SUM($C$6:N6)-SUM($C$11:N11)","v":55610.39999999998},{"$f":"SUM($C$6:O6)-SUM($C$11:O11)","v":45796.799999999974},{"$f":"SUM($C$6:P6)-SUM($C$11:P11)","v":35983.199999999968},{"$f":"SUM($C$6:Q6)-SUM($C$11:Q11)","v":26169.599999999977},{"$f":"SUM($C$6:R6)-SUM($C$11:R11)","v":16355.999999999971},{"$f":"SUM($C$6:S6)-SUM($C$11:S11)","v":57161.736843344697},{"$f":"SUM($C$6:T6)-SUM($C$11:T11)","v":57161.736843344697},{"$f":"SUM($C$6:U6)-SUM($C$11:U11)","v":57161.736843344697},{"$f":"SUM($C$6:V6)-SUM($C$11:V11)","v":57161.736843344697},{"$f":"SUM($C$6:W6)-SUM($C$11:W11)","v":57161.736843344697},{"$f":"SUM($C$6:X6)-SUM($C$11:X11)","v":57161.736843344697},{"$f":"SUM($C$6:Y6)-SUM($C$11:Y11)","v":57161.736843344697},{"$f":"SUM($C$6:Z6)-SUM($C$11:Z11)","v":57161.736843344697},{"$f":"SUM($C$6:AA6)-SUM($C$11:AA11)","v":57161.736843344697},{"$f":"SUM($C$6:AB6)-SUM($C$11:AB11)","v":57161.736843344697},null,null,null,null,null,null,null,null,null,null,null,null,null,null,null,null,null,null,null,null,null,null,null,null,null,null,null,null,null,null,null,null,null,null,null,null,null,null,null,null,"k","A","B","C","D","E","F","G","H","I","J","K","L","M","N","O","P","Q"]
{"$rows_left_out":183}
{"sheet":"Achtergrond","index":6,"n_rows":33,"n_cols":20,"rows_kept":33,"cut":false,"hidden":true,"merged":[]}
[null,null,"aan/uit","in keuze",null,"aan/uit","in keuze",null,"aan/uit","in keuze",null,"aan/uit","in keuze",null,"aan/uit","in keuze",null,"aan/uit","in keuze"]
[null,null,"L_provincie",null,null,"L_locatie",null,null,"Label19",null,null,"Label23","Label42",null,"Label38","Label82",null,"Label35","Label43"]
[null,null,"CB_Provincie",null,null,"TB_locatie_1","Label16","Label20","CB_Panelenhulp",null,null,"Label24",null,null,"L_netafstand","Label83",null,"L_eigenaar"]
[null,null,null,null,null,"Tb_locatie_2","Label17","Label21","L_panelen",null,null,"Label25",null,null,"TB_netafstand_1","Label81",null,"TB_eigenaar_1","Label45","Label50"]
[null,null,null,null,null,"Tb_locatie_3","Label18","Label22","TB_panelen_1","Label27","Label33","L_netaansluiting",null,null,"TB_netafstand_2","Label81",null,"TB_eigenaar_2","Label48"]
[null,null,null,null,null,"Label14",null,null,"TB_panelen_2","Label26","Label34","TB_netaansluiting_1","Label36","Label39","TB_netafstand_3","Label78","Label80","TB_eigenaar_3","Label47","Label49"]
[null,null,null,null,null,"Label15",null,null,"TB_panelen_3","Label30",null,"TB_netaansluiting_2","Label40",null,"TB_netafstand_4","Label78","Label80","CB_eigenaarhulp"]
[null,null,null,null,null,null,null,null,"TB_panelen_4","Label29","Label31","TB_netaansluiting_3","Label37","Label41","TB_netafstand_5","Label77","Label79"]
[null,null,null,null,null,null,null,null,"TB_panelen_5","Label28","Label32","CB_netaansluitinghulp",null,null,"TB_netafstand_6","Label77","Label79"]
[null,null,null,null,null,null,null,null,"TB_panelen_6","Label 84","Label 85"]
{"$rows_left_out":23}